{"text_format":"1","workbook":"xlsx","n_sheets":4,"sheets":["Saisie","Tables","Sortilèges","Equipement"],"not_rendered":{"charts":0,"images":0,"macros":1,"external_links":0,"defined_names":476,"comments":0,"pivot_tables":0},"unopened":[],"bounds":{"document_bytes":16777216,"sheet_cells":100000,"rows_first":2000,"rows_last":500,"rows_between":2000,"halvings":0,"cell_chars":16384,"cell_head_chars":4096},"cells_cut":0,"cells_raw":0,"read":"whole","date_system":"1900"}

{"sheet":"Saisie","index":0,"n_rows":204,"n_cols":14,"rows_kept":204,"cut":false,"hidden":false,"merged":[]}
[]
[null,"Nom : "]
[]
[null,"Né à l'heure"]
[null,"Sexe :",null,"Taille :",null,"Poids : "]
[null,"Cheveux :",null,"Yeux :",null,"Beauté : ",null,{"$f":"IF(G6<>\"\",VLOOKUP(G6,Table_beauté,2,0),\"\")","v":""}]
[null,"Main directrice :"]
[]
[null,"Caractéristiques"]
[]
[null,"TAILLE",null,"VOLONTE"]
[null,"APPARENCE",null,"INTELLECT",null,null,"Vie",{"$f":"ROUNDUP((C11+C13)/2,0)","v":0},"Endurance",{"$f":"MAX(C11+C13,H12+E11)","v":0}]
[null,"CONSTITUTION",null,"EMPATHIE",null,null,"+dom",{"$f":"IF(ISERROR(VLOOKUP(ROUNDDOWN((C11+C14)/2,0),Bonus_dom,2,0)),\"\",VLOOKUP(ROUNDDOWN((C11+C14)/2,0),Bonus_dom,2,0))","v":""},"Malus Armure",{"$f":"IF(ISERROR(IF(VLOOKUP(\"Armures\",Sursoi,2,0)<>\"\",VLOOKUP(VLOOKUP(\"Armures\",Sursoi,2,0),Table_armures,4,0))),\"\",IF(VLOOKUP(\"Armures\",Sursoi,2,0)<>\"\",VLOOKUP(VLOOKUP(\"Armures\",Sursoi,2,0),Table_armures,4,0)))","v":""}]
[null,"FORCE",null,"RÊVE"]
[null,"AGILITE",null,"CHANCE",null,null,"S.Const.",{"$f":"ROUNDDOWN(C13/3,0)","v":0},"Sust.",{"$f":"ROUNDUP((C11-1)/4,0)","v":-1}]
[null,"DEXTERITE",null,"Mêlée",{"$f":"ROUNDDOWN(($C$14+$C$15)/2,0)","v":0},null,"Encombrement",{"$f":"(C11+C14)/2","v":0}]
[null,"VUE",null,"Tir",{"$f":"ROUNDDOWN(($C$17+$C$16)/2,0)","v":0}]
[null,"OUIE",null,"Lancer",{"$f":"ROUNDDOWN(($E$17+$C$14)/2,0)","v":0}]
[null,"ODORAT-GOUT",null,"Dérobée",{"$f":"ROUNDDOWN(($C$15+(21-$C$11))/2,0)","v":10}]
[]
[null,null,"Points restants : ",{"$f":"160-(SUM(C11:C19,E11:E15)+IF((G6-10)>0,(G6-10),))","v":160}]
[]
[null,"Compétences"]
[]
[null,null,null,"(1)(2)(3)(4) Compétences troncs jusqu'à 0 "]
[null,"C. de Mêlée (-6)","Niv.","Pts de Comp.","C. de Tir et Lancer (-8)","Niv.","Pts de Comp.","C.Spécialisées (-11)","Niv.","Pts de Comp."]
[null,"Armes d'hast",-6,{"$f":"VLOOKUP(C27,Cout_comp,4,0)","v":0},"Arbalète",-8,{"$f":"VLOOKUP(F27,Cout_comp,3,0)","v":0},"Acrobatie",-11,{"$f":"VLOOKUP(I27,Cout_comp,2,0)","v":0}]
[null,"Bouclier",-6,0,"Arc",-8,0,"Chirurgie",-11,0]
[null,"Corps à corps(1)",-6,{"$f":"IF(AND(VLOOKUP(C29,Cout_comp,4,0)<=80,OR(VLOOKUP(C29,Cout_comp,4,0)<VLOOKUP(C30,Cout_comp,4,0),VLOOKUP(C29,Cout_comp,4,0)<VLOOKUP(C33,Cout_comp,4,0))),0,IF(AND(VLOOKUP(C29,Cout_comp,4,0)>=80,OR(VLOOKUP(C29,Cout_comp,4,0)<VLOOKUP(C30,Cout_comp,4,0),VLOOKUP(C29,Cout_comp,4,0)<VLOOKUP(C33,Cout_comp,4,0))),VLOOKUP(C29,Cout_comp,4,0)-80,VLOOKUP(C29,Cout_comp,4,0)))","v":0},"Dague",-8,0,"Jeu",-11,0]
[null,"Dague(1)",-6,{"$f":"IF(AND(VLOOKUP(C30,Cout_comp,4,0)<=80,OR(VLOOKUP(C30,Cout_comp,4,0)<=VLOOKUP(C29,Cout_comp,4,0),VLOOKUP(C30,Cout_comp,4,0)<VLOOKUP(C33,Cout_comp,4,0))),0,IF(AND(VLOOKUP(C30,Cout_comp,4,0)>=80,OR(VLOOKUP(C30,Cout_comp,4,0)<=VLOOKUP(C29,Cout_comp,4,0),VLOOKUP(C30,Cout_comp,4,0)<VLOOKUP(C33,Cout_comp,4,0))),VLOOKUP(C30,Cout_comp,4,0)-80,VLOOKUP(C30,Cout_comp,4,0)))","v":0},"Fouet",-8,0,"Jonglerie",-11,0]
[null,"Epée 1 main(2)",-6,{"$f":"IF(AND(VLOOKUP(C31,Cout_comp,4,0)<=80,VLOOKUP(C31,Cout_comp,4,0)<VLOOKUP(C32,Cout_comp,4,0)),0,IF(AND(VLOOKUP(C31,Cout_comp,4,0)>=80,VLOOKUP(C31,Cout_comp,4,0)<VLOOKUP(C32,Cout_comp,4,0)),VLOOKUP(C31,Cout_comp,4,0)-80,VLOOKUP(C31,Cout_comp,4,0)))","v":0},"Fronde",-8,0,"Maroquinerie",-11,0]
[null,"Epee 2 mains(2)",-6,{"$f":"IF(AND(VLOOKUP(C32,Cout_comp,4,0)<=80,VLOOKUP(C32,Cout_comp,4,0)<=VLOOKUP(C31,Cout_comp,4,0)),0,IF(AND(VLOOKUP(C32,Cout_comp,4,0)>=80,VLOOKUP(C32,Cout_comp,4,0)<=VLOOKUP(C31,Cout_comp,4,0)),VLOOKUP(C32,Cout_comp,4,0)-80,VLOOKUP(C32,Cout_comp,4,0)))","v":0},"Hache",-8,0,"Métallurgie",-11,0]
[null,"Esquive(1)",-6,{"$f":"IF(AND(VLOOKUP(C33,Cout_comp,4,0)<=80,OR(VLOOKUP(C33,Cout_comp,4,0)<=VLOOKUP(C29,Cout_comp,4,0),VLOOKUP(C33,Cout_comp,4,0)<=VLOOKUP(C30,Cout_comp,4,0))),0,IF(AND(VLOOKUP(C33,Cout_comp,4,0)>=80,OR(VLOOKUP(C33,Cout_comp,4,0)<=VLOOKUP(C29,Cout_comp,4,0),VLOOKUP(C33,Cout_comp,4,0)<=VLOOKUP(C30,Cout_comp,4,0))),VLOOKUP(C33,Cout_comp,4,0)-80,VLOOKUP(C33,Cout_comp,4,0)))","v":0},"Javelot",-8,0,"Natation",-11,0]
[null,"Fléau",-6,0,null,null,null,"Navigation",-11,0]
[null,"Hache 1 main(3)",-6,{"$f":"IF(AND(VLOOKUP(C35,Cout_comp,4,0)<=80,VLOOKUP(C35,Cout_comp,4,0)<VLOOKUP(C36,Cout_comp,4,0)),0,IF(AND(VLOOKUP(C35,Cout_comp,4,0)>=80,VLOOKUP(C35,Cout_comp,4,0)<VLOOKUP(C36,Cout_comp,4,0)),VLOOKUP(C35,Cout_comp,4,0)-80,VLOOKUP(C35,Cout_comp,4,0)))","v":0},null,null,null,"Orfèvrerie",-11,0]
[null,"Hache 2 mains(3)",-6,{"$f":"IF(AND(VLOOKUP(C36,Cout_comp,4,0)<=80,VLOOKUP(C36,Cout_comp,4,0)<=VLOOKUP(C35,Cout_comp,4,0)),0,IF(AND(VLOOKUP(C36,Cout_comp,4,0)>=80,VLOOKUP(C36,Cout_comp,4,0)<=VLOOKUP(C35,Cout_comp,4,0)),VLOOKUP(C36,Cout_comp,4,0)-80,VLOOKUP(C36,Cout_comp,4,0)))","v":0},null,null,null,"Serrurerie",-11,0]
[null,"Lance",-6,0]
[null,"Masse 1 main(4)",-6,{"$f":"IF(AND(VLOOKUP(C38,Cout_comp,4,0)<=80,VLOOKUP(C38,Cout_comp,4,0)<VLOOKUP(C39,Cout_comp,4,0)),0,IF(AND(VLOOKUP(C38,Cout_comp,4,0)>=80,VLOOKUP(C38,Cout_comp,4,0)<VLOOKUP(C39,Cout_comp,4,0)),VLOOKUP(C38,Cout_comp,4,0)-80,VLOOKUP(C38,Cout_comp,4,0)))","v":0}]
[null,"Masse 2 mains(4)",-6,{"$f":"IF(AND(VLOOKUP(C39,Cout_comp,4,0)<=80,VLOOKUP(C39,Cout_comp,4,0)<=VLOOKUP(C38,Cout_comp,4,0)),0,IF(AND(VLOOKUP(C39,Cout_comp,4,0)>=80,VLOOKUP(C39,Cout_comp,4,0)<=VLOOKUP(C38,Cout_comp,4,0)),VLOOKUP(C39,Cout_comp,4,0)-80,VLOOKUP(C39,Cout_comp,4,0)))","v":0}]
[]
{"$rows_left_out":165}
{"sheet":"Tables","index":1,"n_rows":101,"n_cols":22,"rows_kept":101,"cut":false,"hidden":true,"merged":[]}
["Caractéristiques"]
["Générales",null,"FORCE",null,"Beauté"]
[6,null,6,null,3]
[7,null,7,null,4]
[8,null,8,null,5]
[9,null,9,null,6]
[10,null,10,null,7]
[11,null,{"$f":"IF(ISERROR(IF(Saisie!$C$11 >=7,\"11\",\"\")*1),\"\",IF(Saisie!$C$11 >=7,\"11\",\"\")*1)","v":""},null,8]
[12,null,{"$f":"IF(ISERROR(IF(Saisie!$C$11 >=8,\"12\",\"\")*1),\"\",IF(Saisie!$C$11 >=8,\"12\",\"\")*1)","v":""},null,9]
[13,null,{"$f":"IF(ISERROR(IF(Saisie!$C$11 >=9,\"13\",\"\")*1),\"\",IF(Saisie!$C$11 >=9,\"13\",\"\")*1)","v":""},null,10]
[14,null,{"$f":"IF(ISERROR(IF(Saisie!$C$11 >=10,\"14\",\"\")*1),\"\",IF(Saisie!$C$11 >=10,\"14\",\"\")*1)","v":""},null,11]
[15,null,{"$f":"IF(ISERROR(IF(Saisie!$C$11 >=11,\"15\",\"\")*1),\"\",IF(Saisie!$C$11 >=11,\"15\",\"\")*1)","v":""},null,12]
[null,null,null,null,13]
[null,null,null,null,14]
[null,null,null,null,15]
[null,null,null,null,16]
[]
[]
["Généralités"]
["Heure de naissance",null,"Sexe",null,"Poids",null,null,null,null,null,null,null,null,null,null,null,null,"Menu déroulant poids"]
["du Vaisseau",null,"M",null,6,31,32,33,34,35,36,37,38,39,40,null,null,{"$f":"VLOOKUP(Saisie!$C$11,poids_taille,2,0)","v":{"$error":"#N/A"}}]
["de la Sirène",null,"F",null,7,41,42,43,44,45,46,47,48,49,50,null,null,{"$f":"VLOOKUP(Saisie!$C$11,poids_taille,3,0)","v":{"$error":"#N/A"}}]
["du Faucon",null,null,null,8,51,52,53,54,55,56,57,58,59,60,null,null,{"$f":"VLOOKUP(Saisie!$C$11,poids_taille,4,0)","v":{"$error":"#N/A"}}]
["de la Couronne",null,null,null,9,61,61,62,62,63,63,64,64,65,65,null,null,{"$f":"VLOOKUP(Saisie!$C$11,poids_taille,5,0)","v":{"$error":"#N/A"}}]
["du Dragon",null,null,null,10,66,66,67,67,68,68,69,69,70,70,null,null,{"$f":"VLOOKUP(Saisie!$C$11,poids_taille,6,0)","v":{"$error":"#N/A"}}]
["des Epées",null,null,null,11,71,71,72,72,73,73,74,74,75,75,null,null,{"$f":"VLOOKUP(Saisie!$C$11,poids_taille,7,0)","v":{"$error":"#N/A"}}]
["de la Lyre",null,null,null,12,76,76,77,77,78,78,79,79,80,80,null,null,{"$f":"VLOOKUP(Saisie!$C$11,poids_taille,8,0)","v":{"$error":"#N/A"}}]
["du Serpent",null,null,null,13,81,82,83,84,85,86,87,88,89,90,null,null,{"$f":"VLOOKUP(Saisie!$C$11,poids_taille,9,0)","v":{"$error":"#N/A"}}]
["du Poisson Acrobate",null,null,null,14,91,92,93,94,95,96,97,98,99,100,null,null,{"$f":"VLOOKUP(Saisie!$C$11,poids_taille,10,0)","v":{"$error":"#N/A"}}]
["de l'Araignée",null,null,null,15,101,102,103,104,105,106,107,108,109,110,null,null,{"$f":"VLOOKUP(Saisie!$C$11,poids_taille,11,0)","v":{"$error":"#N/A"}}]
["du Roseau"]
["du Château dormant"]
[]
[null,null,null,null,"Taille",null,null,null,"Menu déroulant taille",null,null,"Beauté",null,null,"Main directrice"]
[null,null,null,null,6,1.26,null,null,{"$f":"VLOOKUP(Saisie!$C$11,Taille_taille,2,0)*0.75","v":{"$error":"#N/A"}},null,null,3,"Hideux",null,"Droitier"]
[null,null,null,null,7,1.43,null,null,{"$f":"VLOOKUP(Saisie!$C$11,Taille_taille,2,0)*0.77","v":{"$error":"#N/A"}},null,null,4,"Repoussant",null,"Gaucher"]
[null,null,null,null,8,1.58,null,null,{"$f":"VLOOKUP(Saisie!$C$11,Taille_taille,2,0)*0.79","v":{"$error":"#N/A"}},null,null,5,"Franchement très laid",null,"Ambidextre"]
[null,null,null,null,9,1.69,null,null,{"$f":"VLOOKUP(Saisie!$C$11,Taille_taille,2,0)*0.81","v":{"$error":"#N/A"}},null,null,6,"laid"]
[null,null,null,null,10,1.75,null,null,{"$f":"VLOOKUP(Saisie!$C$11,Taille_taille,2,0)*0.83","v":{"$error":"#N/A"}},null,null,7,"Très désavantagé"]
[null,null,null,null,11,1.82,null,null,{"$f":"VLOOKUP(Saisie!$C$11,Taille_taille,2,0)*0.85","v":{"$error":"#N/A"}},null,null,8,"Désavantagé"]
{"$rows_left_out":62}
{"sheet":"Sortilèges","index":2,"n_rows":151,"n_cols":8,"rows_kept":151,"cut":false,"hidden":true,"merged":[]}
[]
[null,"Oniros"]
[null,"Diff.","Nom","case","r",null,null,"Menu déroulant Oniros"]
[null,2,"Anti-Magie","Plaines","1+",-2,null,{"$f":"IF(Saisie!$D$62>=Sortilèges!B4,Sortilèges!C4,\"\")","v":""}]
[null,2,"Clameurs","Cité","1+",-2,null,{"$f":"IF(Saisie!$D$62>=Sortilèges!B5,Sortilèges!C5,\"\")","v":""}]
[null,2,"Silence","Désert",4,-2,null,{"$f":"IF(Saisie!$D$62>=Sortilèges!B6,Sortilèges!C6,\"\")","v":""}]
[null,3,"Brouillard","Forêt","1+",-3,null,{"$f":"IF(Saisie!$D$62>=Sortilèges!B7,Sortilèges!C7,\"\")","v":""}]
[null,3,"Lanterne","Cité",2,-3,null,{"$f":"IF(Saisie!$D$62>=Sortilèges!B8,Sortilèges!C8,\"\")","v":""}]
[null,3,"Quiétude","Nécropole",4,-3,null,{"$f":"IF(Saisie!$D$62>=Sortilèges!B9,Sortilèges!C9,\"\")","v":""}]
[null,3,"Détection d'Aura","Sanctuaire",1,-3,null,{"$f":"IF(Saisie!$D$62>=Sortilèges!B10,Sortilèges!C10,\"\")","v":""}]
[null,3,"Lecture d'Aura","Sanctuaire",3,-3,null,{"$f":"IF(Saisie!$D$62>=Sortilèges!B11,Sortilèges!C11,\"\")","v":""}]
[null,4,"Chaleur","Cité","1+",-4,null,{"$f":"IF(Saisie!$D$62>=Sortilèges!B12,Sortilèges!C12,\"\")","v":""}]
[null,4,"Froid","Désolation","1+",-4,null,{"$f":"IF(Saisie!$D$62>=Sortilèges!B13,Sortilèges!C13,\"\")","v":""}]
[null,4,"Illusion animale","Forêt",4,-4,null,{"$f":"IF(Saisie!$D$62>=Sortilèges!B14,Sortilèges!C14,\"\")","v":""}]
[null,4,"Illusion géographique","Gouffre",4,-4,null,{"$f":"IF(Saisie!$D$62>=Sortilèges!B15,Sortilèges!C15,\"\")","v":""}]
[null,4,"Lumière","Plaines",3,-4,null,{"$f":"IF(Saisie!$D$62>=Sortilèges!B16,Sortilèges!C16,\"\")","v":""}]
[null,4,"Ténèbres","Gouffre",3,-4,null,{"$f":"IF(Saisie!$D$62>=Sortilèges!B17,Sortilèges!C17,\"\")","v":""}]
[null,4,"Bois en Terre","Nécropole",2,-4,null,{"$f":"IF(Saisie!$D$62>=Sortilèges!B18,Sortilèges!C18,\"\")","v":""}]
[null,4,"Eau en Air","Désert",2,-4,null,{"$f":"IF(Saisie!$D$62>=Sortilèges!B19,Sortilèges!C19,\"\")","v":""}]
[null,4,"Eau en Bois","Forêt",2,-4,null,{"$f":"IF(Saisie!$D$62>=Sortilèges!B20,Sortilèges!C20,\"\")","v":""}]
[null,4,"Feu en Air","Désolation",2,-4,null,{"$f":"IF(Saisie!$D$62>=Sortilèges!B21,Sortilèges!C21,\"\")","v":""}]
[null,4,"Terre en Bois","Plaines",2,-4,null,{"$f":"IF(Saisie!$D$62>=Sortilèges!B22,Sortilèges!C22,\"\")","v":""}]
[null,4,"Bois transparent","Cité",4,-4,null,{"$f":"IF(Saisie!$D$62>=Sortilèges!B23,Sortilèges!C23,\"\")","v":""}]
[null,4,"Métal transparent","Gouffre",4,-4,null,{"$f":"IF(Saisie!$D$62>=Sortilèges!B24,Sortilèges!C24,\"\")","v":""}]
[null,4,"Terre transparente","Collines",4,-4,null,{"$f":"IF(Saisie!$D$62>=Sortilèges!B25,Sortilèges!C25,\"\")","v":""}]
[null,4,"Elargissement de zone","variable",4,-4,null,{"$f":"IF(Saisie!$D$62>=Sortilèges!B26,Sortilèges!C26,\"\")","v":""}]
[null,4,"Annulation de ses propres zones","Variable",2,-4,null,{"$f":"IF(Saisie!$D$62>=Sortilèges!B27,Sortilèges!C27,\"\")","v":""}]
[null,5,"Miroirs","Sanctuaire",5,-5,null,{"$f":"IF(Saisie!$D$62>=Sortilèges!B28,Sortilèges!C28,\"\")","v":""}]
[null,6,"Croissance végétale","Forêt",5,-6,null,{"$f":"IF(Saisie!$D$62>=Sortilèges!B29,Sortilèges!C29,\"\")","v":""}]
[null,6,"Illusion humanoïde","Cité","2+",-6,null,{"$f":"IF(Saisie!$D$62>=Sortilèges!B30,Sortilèges!C30,\"\")","v":""}]
[null,6,"Pont immatériel","Pont","2+",-6,null,{"$f":"IF(Saisie!$D$62>=Sortilèges!B31,Sortilèges!C31,\"\")","v":""}]
[null,6,"Bois en Eau","Sanctuaire",4,-6,null,{"$f":"IF(Saisie!$D$62>=Sortilèges!B32,Sortilèges!C32,\"\")","v":""}]
[null,6,"Bois en Feu","Désert",4,-6,null,{"$f":"IF(Saisie!$D$62>=Sortilèges!B33,Sortilèges!C33,\"\")","v":""}]
[null,6,"Bois en Métal","Monts",4,-6,null,{"$f":"IF(Saisie!$D$62>=Sortilèges!B34,Sortilèges!C34,\"\")","v":""}]
[null,6,"Eau en Métal","Sanctuaire",4,-6,null,{"$f":"IF(Saisie!$D$62>=Sortilèges!B35,Sortilèges!C35,\"\")","v":""}]
[null,6,"Eau en Terre","Pont",4,-6,null,{"$f":"IF(Saisie!$D$62>=Sortilèges!B36,Sortilèges!C36,\"\")","v":""}]
[null,6,"Feu en Bois","Collines",4,-6,null,{"$f":"IF(Saisie!$D$62>=Sortilèges!B37,Sortilèges!C37,\"\")","v":""}]
[null,6,"Feu en Eau","Cité",4,-6,null,{"$f":"IF(Saisie!$D$62>=Sortilèges!B38,Sortilèges!C38,\"\")","v":""}]
[null,6,"Feu en Métal","Sanctuaire",4,-6,null,{"$f":"IF(Saisie!$D$62>=Sortilèges!B39,Sortilèges!C39,\"\")","v":""}]
[null,6,"Feu en Terre","Désert",4,-6,null,{"$f":"IF(Saisie!$D$62>=Sortilèges!B40,Sortilèges!C40,\"\")","v":""}]
{"$rows_left_out":112}
{"sheet":"Equipement","index":3,"n_rows":444,"n_cols":35,"rows_kept":444,"cut":false,"hidden":true,"merged":[]}
["1er et 2eme niv de cascade"]
[]
[null,"Armes_de_mêlée","Armes_de_tir","Armes_de_lancer","Armures","Contenants_et_Bagages","Ecrire","Feux","Herbes_de_soin","Herbes_diverses","Jouer","Jute_Fil_Corde_Tissus","Outillage","Poterie_Cuisine","Remèdes_et_Antidotes","Sels_alchimiques","Soins","Sustentation","Vêtements","Expédiants_divers",null,"Contenants_uniques","Contenants_petite_capacité","Contenants_moy_gde_capacité",null,null,null,null,"Locomotion",null,"Outre_cuir_2l_c","Carquois_cuir_c","Etui_à_luth_cuir_c","Fiole_de_grès_20cl_c","Fiole_de_verre_20cl_c"]
[null,"Dague","Arbalète","Dague","Drap_matelassé","Sac_à_dos_cuir_40l","Feuille_de_parchemin ","Chandelle_de_suif_1_heure","Fausse_Suppure","Herbe_de_Lune_7_brins","Flûte_à_bec","Bâche_1m²","Hachette","Mortier_en_marbre","Bitume_de_Camphre","Candide","Miroir_de_cuivre_20cm","Provisions_non_cuites_1_sust","Pourpoint_de_cuir_souple","Pleureuse_i",null,"Fiole_de_grès_20cl_c","Aumônière_cuir_c","Sac_à_dos_cuir_40l",null,null,null,null,"Cheval_de_selle",null,"Sustentation","Armes_de_tir","Armes_de_mêlée","Sustentation","Sustentation"]
[null,"Epée_gnome","Arc","Javelot","Cuir_souple","Besace_cuir_5l","Encre_20cl","Bougie_de_cire_2h","Suppure","Mercurion","Luth","Toile_de_voile_1m²","Grappin","Pilon_en_marbre","Gelée_royale","Boralm","Brosse_à_cheveux","Provisions_cuites_1_sust","Cotte_de_cuir_souple","Crapauvure_i",null,"Fiole_de_verre_20cl_c","Bourse_cuir_c","Besace_cuir_5l_c",null,null,null,null,"Cheval_de_trait",null,"Herbes_de_soin","Armes_de_lancer","Jouer","Herbes_de_soin","Herbes_de_soin"]
[null,"Esparlongue","Fronde","Fouet","Cuir_épais","Aumônière_cuir","Crayon_à_mine_de_plomb","Torche_30mn","Méritoine","Satum","Harpe","Tresse_de_crins","Pelle","Pichet_de_grès_1l","Tournegraisse","Odyssum_vert","Peigne_en_corne","Vin_20cl","Culottes de cuir souple","Sucre_de_Xotel_i",null,"Etui_à_luth_cuir_c","Besace_cuir_5l_c","Sac_en_jute_50l",null,null,null,null,"Mule",null,"Remèdes_et_Antidotes",null,"Armes_de_tir","Remèdes_et_Antidotes","Remèdes_et_Antidotes"]
[null,"Epée_cyane","Flèche",null,"Cuir_plus_métal","Bourse_cuir","Ecritoire","Huile_4h_20cl","Ortigal","Névropenthe","Tambourin","Bobine_de_fil","Marteau","Chope_de_grès_20cl","Perle_de_Bjwal","Odyssum_gris","Eponge","Bière_20cl","Bottes_de_cuir_souple","Mauvèze_l",null,"Carquois_cuir_c",null,"Sac_en_jute_20l",null,null,null,null,"Ane",null,"Sels_alchimiques",null,null,"Sels_alchimiques","Sels_alchimiques"]
[null,"Epée_dragonne","Carreau",null,"Mailles_de_fer","Outre_cuir_2l","Plume_de_fer","Lanterne_à_huile","Ortigal_noir","Chronophile_3_brins","Cor_en_corne","Ficelle_10m ","Maillet","Chope_de_fer_20cl","SablePoudre",null,"Savon_500g","Hydromel_20cl","Sandales_cuir","Arachnaire_l",null,"Outre_cuir_2l_c",null,null,null,null,null,null,"Aligate",null,"Herbes_diverses",null,null,"Herbes_diverses","Herbes_diverses"]
[null,"Epée_sorde",null,null,"Plaques_de_fer","Tube_à_parchemins_cuir","Porteplume_en_bois","Lanterne_à_bougie","Bélidane","Herbe_à_pipe_1_dose","Dé_à_jouer_en_os","Cordelette_10m","Burin_ou_Gouge","Ecuelle_de_grès","Topazoïne",null,"Petit_pot_de_fard","Brandevin_10cl","Gants_cuir","Vent_du_nord_l",null,"Tube_à_parchemins_cuir_c",null,null,null,null,null,null,"Zyglute",null,"Feux",null,null,"Feux","Feux"]
[null,"Epée_bâtarde",null,null,null,"Etui_à_luth_cuir","Cire_à_cacheter","Briquet_à_silex","Faux_Murus",null,"Echecs_draconics_en_bois","Corde_10m","Lime_ou_Râpe","Ecuelle_de_fer","Elixir_des_Gnomes",null,"Matériel_de_chirurgie","Lait_20cl","Ceinturon_cuir",null,null,null,null,null,null,null,null,null,"Selle_et_harnais",null,null,null,null,"Expédiants_divers","Expédiants_divers"]
[null,"Double_dragonne",null,null,null,"Carquois_cuir","Craie_1_bâton","Soufflet","Murus",null,"Viole","Lacet_cuir_1m","Scie","Poêle_à_frire_40cm","Lait_de_lune",null,"Rasoir","Eau_20cl","Chapeau_cuir",null,null,null,null,null,null,null,null,null,"Chariot_4_roues"]
[null,"Hachette",null,null,null,"Sac_en_jute_50l","Sablier_15_minutes","Pot_à_braise","Tanemiel",null,null,"tissu_de_laine_1m²","Gros_clou","Casserolle_en_fer_1l","Liqueur_de_Bagdol",null,"Couverture_de_laine",null,"Manteau_de_fourrure",null,null,null,null,null,null,null,null,null,"Charrette_2_roues"]
[null,"Hache_de_bataille",null,null,null,"Sac_en_jute_20l","Verre_grossissant","Pipe_en_bois","Tanemiel_doré",null,null,"tissu_de_lin_1m²","Alêne_ou_poinçon","Marmite_de_fer_3l","Mirobolant",null,null,null,"Pourpoint_de_drap_matelassé"]
[null,"Grande_hache",null,null,null,"Fiole_de_grès_20cl","Cristal_alchimique",null,null,null,null,"soie_ou_velours_1m²","Aiguille_à_coudre","Marmite_de_fer_5l","Teinture_d_Erozonne",null,null,null,"Cotte_de_drap_matelassé"]
[null,"Gourdin",null,null,null,"Fiole_de_verre_20cl",null,null,null,null,null,null,"Hameçon","Bouilloire_de_fer_2l","Huile_de_Sélikanthe",null,null,null,"Culottes_de_drap_matelassé",null,null,null,"contenant","contenance"]
[null,"Bâton",null,null,null,null,null,null,null,null,null,null,"Couteau_de_cuisine","Entonnoir_de_fer",null,null,null,null,"Bas_de_laine",null,null,null,"Bourse_cuir_c",0.3]
[null,"Massette",null,null,null,null,null,null,null,null,null,null,"Pierre_à_aiguiser","Cuillère_de_fer",null,null,null,null,"Chemise_de_laine",null,null,null,"Aumônière_cuir_c",1,null,null,null,null,null,null,"Aumônière_cuir_c","Bourse_cuir_c","Tube_à_parchemins_cuir_c","Besace_cuir_5l_c"]
[null,"Masse_lourde",null,null,null,null,null,null,null,null,null,null,"Crochets_de_serrurier","Cuillère_de_bois",null,null,null,null,"Chemise_de_lin",null,null,null,"Tube_à_parchemins_cuir_c",0.1,null,null,null,null,null,null,"Armes_de_mêlée","Ecrire","Ecrire","Armes_de_mêlée"]
[null,"Fléau_léger",null,null,null,null,null,null,null,null,null,null,"Graisse_à_bottes_500g","Seau_de_fer_et_bois_10l",null,null,null,null,"Culottes_de_laine",null,null,null,"Besace_cuir_5l_c",2.5,null,null,null,null,null,null,"Contenants_et_Bagages","Feux",null,"Armes_de_tir"]
[null,"Fléau_lourd",null,null,null,null,null,null,null,null,null,null,"Cire_d_abeille_500g","Tonnelet_10l",null,null,null,null,"Robe_de_laine",null,null,null,"Fiole_de_grès_20cl_c",0.1,null,null,null,null,null,null,"Ecrire","Herbes_de_soin",null,"Armes_de_lancer"]
[null,"Lance_courte",null,null,null,null,null,null,null,null,null,null,"Lingot_cuivre_1kg","Charbon_de_bois_1kg",null,null,null,null,"Robe_de_lin",null,null,null,"Fiole_de_verre_20cl_c",0.1,null,null,null,null,null,null,"Feux","Herbes_diverses",null,"Contenants_et_Bagages"]
[null,"Javeline",null,null,null,null,null,null,null,null,null,null,"Lingot_fer_1kg",null,null,null,null,null,"Cotte_de_laine",null,null,null,"Etui_à_luth_cuir_c",1.1000000000000001,null,null,null,null,null,null,"Herbes_de_soin","Jouer",null,"Ecrire"]
[null,"Arme_d_hast",null,null,null,null,null,null,null,null,null,null,"Lingot_étain_1kg",null,null,null,null,null,"Bonnet_de_laine",null,null,null,"Carquois_cuir_c",2,null,null,null,null,null,null,"Herbes_diverses","Jute_Fil_Corde_Tissus",null,"Feux"]
[null,"Bouclier_léger",null,null,null,null,null,null,null,null,null,null,"Lingot_argent_1kg",null,null,null,null,null,"Chaperon_de_laine",null,null,null,"Outre_cuir_2l_c",1,null,null,null,null,null,null,"Jouer","Outillage",null,"Jouer"]
[null,"Bouclier_moyen",null,null,null,null,null,null,null,null,null,null,null,null,null,null,null,null,"Manteau_de_laine",null,null,null,"Sac_à_dos_cuir_40l",20,null,null,null,null,null,null,"Jute_Fil_Corde_Tissus","Poterie_Cuisine",null,"Jute_Fil_Corde_Tissus"]
[null,"Bouclier_lourd",null,null,null,null,null,null,null,null,null,null,null,null,null,null,null,null,"Chemise_de_soie",null,null,null,"Sac_en_jute_50l",25,null,null,null,null,null,null,"Outillage","Remèdes_et_Antidotes",null,"Outillage"]
[null,null,null,null,null,null,null,null,null,null,null,null,null,null,null,null,null,null,"Robe_de_soie",null,null,null,"Sac_en_jute_20l",10,null,null,null,null,null,null,"Poterie_Cuisine","Sels_alchimiques",null,"Poterie_Cuisine"]
[null,null,null,null,null,null,null,null,null,null,null,null,null,null,null,null,null,null,"Robe_de_velours",null,null,null,null,null,null,null,null,null,null,null,"Soins","Soins",null,"Soins"]
[null,null,null,null,null,null,null,null,null,null,null,null,null,null,null,null,null,null,"Culottes_de_velours",null,null,null,null,null,null,null,null,null,null,null,"Sustentation","Sustentation",null,"Sustentation"]
[null,null,null,null,null,null,null,null,null,null,null,null,null,null,null,null,null,null,"Pourpoint_de_velours",null,null,null,null,null,null,null,null,null,null,null,"Vêtements","Expédiants_divers",null,"Vêtements"]
[null,null,null,null,null,null,null,null,null,null,null,null,null,null,null,null,null,null,"Manteau_de_velours"]
[null,null,null,null,null,null,null,null,null,null,null,null,null,null,null,null,null,null,"Béret_de_velours"]
[null,null,null,null,null,null,null,null,null,null,null,null,null,null,null,null,null,null,"Bas_de_soie"]
[]
[]
[]
[]
[null,"Armes de mêlée","enc.","prix"]
[null,"Dague",0.5,"3s",null,1,2,3,4,5]
[null,"Epée_gnome",1,"12s",null,1,2]
{"$rows_left_out":404}